Reaction Details
TargetHistone deacetylase 2
LigandBDBM50032274
Substrate/Competitorn/a
Meas. Tech.ChEMBL_1440125 (CHEMBL3382538)
Ki 900±n/a nM
Citation Maolanon, ARVilladsen, JSChristensen, NJHoeck, CFriis, THarris, PGotfredsen, CHFristrup, POlsen, CA Methyl effect in azumamides provides insight into histone deacetylase inhibition by macrocycles. J Med Chem57:9644-57 (2014) 
 
Histone deacetylase 2
Name:Histone deacetylase 2
Type:Chromatin regulator; hydrolase; repressor
Mol. Mass.:55356.54
Organism:Homo sapiens (Human)
Description:Q92769
Residue:488
BDBM50032274
NameBDBM50032274
Synonyms:CHEMBL3352996
TypeSmall organic molecule
Emp. Form.C26H36N4O6
Mol. Mass.500.5872
SMILESCC(C)[C@H]1NC(=O)C[C@@H](C\C=C/CCC(O)=O)NC(=O)[C@@H](Cc2ccccc2)NC(=O)[C@@H](C)NC1=O