Reaction Details
TargetEpidermal growth factor receptor
LigandBDBM5446
Substrate/Competitorn/a
Meas. Tech.ChEMBL_1440951 (CHEMBL3375801)
Ki 0.100000±n/a nM
Citation Hanan, EJEigenbrot, CBryan, MCBurdick, DJChan, BKChen, YDotson, JHeald, RAJackson, PSLa, HLainchbury, MDMalek, SPurkey, HESchaefer, GSchmidt, SSeward, EMSideris, STam, CWang, SYeap, SKYen, IYin, JYu, CZilberleyb, IHeffron, TP Discovery of selective and noncovalent diaminopyrimidine-based inhibitors of epidermal growth factor receptor containing the T790M resistance mutation. J Med Chem57:10176-91 (2014) 
 
Epidermal growth factor receptor
Name:Epidermal growth factor receptor
Type:Receptor Kinase Domain
Mol. Mass.:134279.59
Organism:Homo sapiens (Human)
Description:P00533
Residue:1210
BDBM5446
NameBDBM5446
Synonyms:CHEMBL553 Erlotinib N-(3-Ethynylphenyl)-6,7-bis(2-methoxyethoxy)-4-quinazolinamine Monohydrochloride OSI-774 US10189853, erlotinib US11524945, Compound Erlotinib US9730934, Erlotinib cid_176870
TypeSmall organic molecule
Emp. Form.C22H23N3O4
Mol. Mass.393.4357
SMILESCOCCOc1cc2ncnc(Nc3cccc(c3)C#C)c2cc1OCCOC