Reaction Details
TargetEpidermal growth factor receptor
LigandBDBM50032626
Substrate/Competitorn/a
Meas. Tech.ChEMBL_1440949 (CHEMBL3375799)
Ki 33±n/a nM
Citation Hanan, EJEigenbrot, CBryan, MCBurdick, DJChan, BKChen, YDotson, JHeald, RAJackson, PSLa, HLainchbury, MDMalek, SPurkey, HESchaefer, GSchmidt, SSeward, EMSideris, STam, CWang, SYeap, SKYen, IYin, JYu, CZilberleyb, IHeffron, TP Discovery of selective and noncovalent diaminopyrimidine-based inhibitors of epidermal growth factor receptor containing the T790M resistance mutation. J Med Chem57:10176-91 (2014) 
 
Epidermal growth factor receptor
Name:Epidermal growth factor receptor
Synonyms:Epidermal growth factor receptor/Receptor tyrosine-protein kinase erbB-2/Receptor tyrosine-protein kinase erbB-3/Receptor tyrosine-protein kinase erbB-4
Type:n/a
Mol. Mass.:n/a
Description:ASSAY_ID of ChEMBL is 2209351
Components:This complex has 4 components.
Component 1
Name:Receptor tyrosine-protein kinase erbB-2
Type:n/a
Mol. Mass.:137894.47
Organism:Homo sapiens (Human)
Description:P04626
Residue:1255
Component 2
Name:Epidermal growth factor receptor
Synonyms:EGF Receptor Substrate EGFR_HUMAN ERBB1 Epidermal Growth Factor Receptor erbB-1 Epidermal growth factor receptor (EGFR) HER1 Proto-oncogene c-ErbB-1 Tyrosine-Protein Kinase ErbB-1
Type:Receptor Kinase Domain
Mol. Mass.:134279.59
Organism:Homo sapiens (Human)
Description:P00533
Residue:1210
Component 3
Name:Receptor tyrosine-protein kinase erbB-4
Synonyms:ERBB4 Epidermal growth factor receptor ErbB-4 (HER4) Tyrosine Kinase Proto-oncogene c-ErbB-4 Receptor protein-tyrosine kinase erbB-4 Tyrosine kinase-type cell surface receptor HER4 (HER4)
Type:Protein
Mol. Mass.:146803.56
Organism:Homo sapiens (Human)
Description:Q15303
Residue:1308
Component 4
Name:Receptor tyrosine-protein kinase erbB-3
Synonyms:ERBB3 HER3 Tyrosine kinase-type cell surface receptor HER3
Type:PROTEIN
Mol. Mass.:148097.73
Organism:Homo sapiens (Human)
Description:ChEMBL_774331
Residue:1342
BDBM50032626
NameBDBM50032626
Synonyms:CHEMBL3354188
TypeSmall organic molecule
Emp. Form.C20H26N6O
Mol. Mass.366.46
SMILESCOC1CCN(CC1)c1nccc(Nc2cc3n(ccc3cn2)C(C)C)n1