Reaction Details
TargetPeregrin
LigandBDBM50032911
Substrate/Competitorn/a
Meas. Tech.ChEMBL_1431805 (CHEMBL3385101)
IC50 3162±n/a nM
Citation Demont, EHBamborough, PChung, CWCraggs, PDFallon, DGordon, LJGrandi, PHobbs, CIHussain, JJones, EJLe Gall, AMichon, AMMitchell, DJPrinjha, RKRoberts, ADSheppard, RJWatson, RJ 1,3-Dimethyl Benzimidazolones Are Potent, Selective Inhibitors of the BRPF1 Bromodomain. ACS Med Chem Lett5:1190-5 (2014) 
 
Peregrin
Name:Peregrin
Type:PROTEIN
Mol. Mass.:137524.47
Organism:Homo sapiens (Human)
Description:ChEMBL_108054
Residue:1214
BDBM50032911
NameBDBM50032911
Synonyms:CHEMBL1535485
TypeSmall organic molecule
Emp. Form.C17H17N3O3
Mol. Mass.311.3352
SMILESCOc1cccc(c1)C(=O)Nc1ccc2n(C)c(=O)n(C)c2c1