Reaction Details
TargetPeregrin
LigandBDBM50032925
Substrate/Competitorn/a
Meas. Tech.ChEMBL_1431805 (CHEMBL3385101)
IC50 1585±n/a nM
Citation Demont, EHBamborough, PChung, CWCraggs, PDFallon, DGordon, LJGrandi, PHobbs, CIHussain, JJones, EJLe Gall, AMichon, AMMitchell, DJPrinjha, RKRoberts, ADSheppard, RJWatson, RJ 1,3-Dimethyl Benzimidazolones Are Potent, Selective Inhibitors of the BRPF1 Bromodomain. ACS Med Chem Lett5:1190-5 (2014) 
 
Peregrin
Name:Peregrin
Type:PROTEIN
Mol. Mass.:137524.47
Organism:Homo sapiens (Human)
Description:ChEMBL_108054
Residue:1214
BDBM50032925
NameBDBM50032925
Synonyms:CHEMBL3356146
TypeSmall organic molecule
Emp. Form.C18H19N3O3
Mol. Mass.325.3618
SMILESCOc1ccccc1C(=O)Nc1cc2n(C)c(=O)n(C)c2cc1C