Reaction Details
TargetGlycylpeptide N-tetradecanoyltransferase 1
LigandBDBM50033480
Substrate/Competitorn/a
Meas. Tech.ChEMBL_1435039 (CHEMBL3387685)
IC50 4.0±n/a nM
Citation Brand, SNorcross, NRThompson, SHarrison, JRSmith, VCRobinson, DATorrie, LSMcElroy, SPHallyburton, INorval, SScullion, PStojanovski, LSimeons, FRvan Aalten, DFrearson, JABrenk, RFairlamb, AHFerguson, MAWyatt, PGGilbert, IHRead, KD Lead optimization of a pyrazole sulfonamide series of Trypanosoma brucei N-myristoyltransferase inhibitors: identification and evaluation of CNS penetrant compounds as potential treatments for stage 2 human African trypanosomiasis. J Med Chem57:9855-69 (2014) 
 
Glycylpeptide N-tetradecanoyltransferase 1
Name:Glycylpeptide N-tetradecanoyltransferase 1
Type:Enzyme
Mol. Mass.:56814.10
Organism:Homo sapiens (Human)
Description:P30419
Residue:496
BDBM50033480
NameBDBM50033480
Synonyms:CHEMBL3357697
TypeSmall organic molecule
Emp. Form.C22H32Cl2N4O2S
Mol. Mass.487.486
SMILESCN1CCC(CCCCc2cc(Cl)c(c(Cl)c2)S(=O)(=O)Nc2c(C)nn(C)c2C)CC1