Reaction Details
TargetFalcipain 2
LigandBDBM50033659
Substrate/Competitorn/a
Meas. Tech.ChEMBL_1435072 (CHEMBL3388289)
IC50 25±n/a nM
Citation Conroy, TGuo, JTElias, NCergol, KMGut, JLegac, JKhatoon, LLiu, YMcGowan, SRosenthal, PJHunt, NHPayne, RJ Synthesis of gallinamide A analogues as potent falcipain inhibitors and antimalarials. J Med Chem57:10557-63 (2014) 
 
Falcipain 2
Name:Falcipain 2
Type:Enzyme
Mol. Mass.:55912.60
Organism:Plasmodium falciparum
Description:Recombinant falcipain-2.
Residue:484
BDBM50033659
NameBDBM50033659
Synonyms:CHEMBL3358140
TypeSmall organic molecule
Emp. Form.C31H50F3N5O8
Mol. Mass.677.7526
SMILES[O-]C(=O)C(F)(F)F.COC1=CC(=O)N(C1)C(=O)\C=C\[C@H](C)NC(=O)[C@H](CC(C)C)NC(=O)[C@H](CC(C)C)NC(=O)[C@H](C(C)C)[NH+](C)C