Reaction Details
TargetFalcipain 2
LigandBDBM50033762
Substrate/Competitorn/a
Meas. Tech.ChEMBL_1435069 (CHEMBL3388286)
IC50 8.5±n/a nM
Citation Conroy, TGuo, JTElias, NCergol, KMGut, JLegac, JKhatoon, LLiu, YMcGowan, SRosenthal, PJHunt, NHPayne, RJ Synthesis of gallinamide A analogues as potent falcipain inhibitors and antimalarials. J Med Chem57:10557-63 (2014) 
 
Falcipain 2
Name:Falcipain 2
Type:Enzyme
Mol. Mass.:55912.60
Organism:Plasmodium falciparum
Description:Recombinant falcipain-2.
Residue:484
BDBM50033762
NameBDBM50033762
Synonyms:Gallinamide A
TypeSmall organic molecule
Emp. Form.C31H52N4O7
Mol. Mass.592.7672
SMILESCC[C@H](C)[C@H](N(C)C)C(=O)O[C@@H](CC(C)C)C(=O)N[C@@H](CC(C)C)C(=O)N[C@@H](C)\C=C\C(=O)N1[C@@H](C)C(OC)=CC1=O