Reaction Details
TargetAcetyl-CoA carboxylase 1
LigandBDBM50034495
Substrate/Competitorn/a
Meas. Tech.ChEMBL_1437939 (CHEMBL3385489)
IC50 62±n/a nM
Citation Griffith, DAKung, DWEsler, WPAmor, PABagley, SWBeysen, CCarvajal-Gonzalez, SDoran, SDLimberakis, CMathiowetz, AMMcPherson, KPrice, DARavussin, ESonnenberg, GESouthers, JASweet, LJTurner, SMVajdos, FF Decreasing the rate of metabolic ketone reduction in the discovery of a clinical acetyl-CoA carboxylase inhibitor for the treatment of diabetes. J Med Chem57:10512-26 (2014) 
 
Acetyl-CoA carboxylase 1
Name:Acetyl-CoA carboxylase 1
Type:Protein
Mol. Mass.:265543.22
Organism:Homo sapiens (Human)
Description:Q13085
Residue:2346
BDBM50034495
NameBDBM50034495
Synonyms:CHEMBL3359262
TypeSmall organic molecule
Emp. Form.C22H25N5O2
Mol. Mass.391.4662
SMILESCC(C)n1ncc2CC3(CCN(CC3)C(=O)c3ccc4[nH]ncc4c3)CC(=O)c12