Reaction Details
TargetBeta-secretase 1
LigandBDBM50036596
Substrate/Competitorn/a
Meas. Tech.ChEMBL_1433718 (CHEMBL3386389)
Ki 3.0±n/a nM
Citation Caldwell, JPMazzola, RDDurkin, JChen, JChen, XFavreau, LKennedy, MKuvelkar, RLee, JMcHugh, NMcKittrick, BOrth, PStamford, AStrickland, CVoigt, JWang, LZhang, LZhang, QZhu, Z Discovery of potent iminoheterocycle BACE1 inhibitors. Bioorg Med Chem Lett24:5455-9 (2015) 
 
Beta-secretase 1
Name:Beta-secretase 1
Type:Protein
Mol. Mass.:55755.10
Organism:Homo sapiens (Human)
Description:P56817
Residue:501
BDBM50036596
NameBDBM50036596
Synonyms:CHEMBL3354260
TypeSmall organic molecule
Emp. Form.C27H38N6O2
Mol. Mass.478.6296
SMILESCN1C(=N)N[C@](CCC2CCCCC2)(C[C@H]2CCC[C@H](C2)NC(=O)Nc2ccc(cc2)C#N)C1=O