Reaction Details
TargetCathepsin D
LigandBDBM50036596
Substrate/Competitorn/a
Meas. Tech.ChEMBL_1433719 (CHEMBL3386390)
Ki 6900±n/a nM
Citation Caldwell, JPMazzola, RDDurkin, JChen, JChen, XFavreau, LKennedy, MKuvelkar, RLee, JMcHugh, NMcKittrick, BOrth, PStamford, AStrickland, CVoigt, JWang, LZhang, LZhang, QZhu, Z Discovery of potent iminoheterocycle BACE1 inhibitors. Bioorg Med Chem Lett24:5455-9 (2015) 
 
Cathepsin D
Name:Cathepsin D
Type:Enzyme
Mol. Mass.:44551.72
Organism:Homo sapiens (Human)
Description:Human proCathepsin D (SwissProt accession number P07339) was expressed in Sf9 cells, purified, and autoactivated.
Residue:412
BDBM50036596
NameBDBM50036596
Synonyms:CHEMBL3354260
TypeSmall organic molecule
Emp. Form.C27H38N6O2
Mol. Mass.478.6296
SMILESCN1C(=N)N[C@](CCC2CCCCC2)(C[C@H]2CCC[C@H](C2)NC(=O)Nc2ccc(cc2)C#N)C1=O