Reaction Details
TargetTransient receptor potential cation channel subfamily M member 8
LigandBDBM50036521
Substrate/Competitorn/a
Meas. Tech.ChEMBL_1432887 (CHEMBL3383300)
IC50 42±n/a nM
Citation Ohmi, MShishido, YInoue, TAndo, KFujiuchi, AYamada, AWatanabe, SKawamura, K Identification of a novel 2-pyridyl-benzensulfonamide derivative, RQ-00203078, as a selective and orally active TRPM8 antagonist. Bioorg Med Chem Lett24:5364-8 (2014) 
 
Transient receptor potential cation channel subfamily M member 8
Name:Transient receptor potential cation channel subfamily M member 8
Type:Enzyme
Mol. Mass.:127693.26
Organism:Homo sapiens (Human)
Description:Q7Z2W7
Residue:1104
BDBM50036521
NameBDBM50036521
Synonyms:CHEMBL3353573
TypeSmall organic molecule
Emp. Form.C20H16ClF3N2O3S
Mol. Mass.456.866
SMILESOCc1ccc(cc1)S(=O)(=O)N(Cc1ccccc1)c1ncc(cc1Cl)C(F)(F)F