Reaction Details
TargetC-X-C chemokine receptor type 2
LigandBDBM50036788
Substrate/Competitorn/a
Meas. Tech.ChEMBL_1434449 (CHEMBL3388266)
IC50 2512±n/a nM
Citation Lu, HYang, TXu, ZWren, PBZhang, YCai, XPatel, MDong, KZhang, QZhang, WGuan, XXiang, JElliott, JDLin, XRen, F 2-Aminopyrimidin-4(1H)-one as the novel bioisostere of urea: discovery of novel and potent CXCR2 antagonists. Bioorg Med Chem Lett24:5493-6 (2015) 
 
C-X-C chemokine receptor type 2
Name:C-X-C chemokine receptor type 2
Type:Protein
Mol. Mass.:40767.88
Organism:Homo sapiens (Human)
Description:P25025
Residue:360
BDBM50036788
NameBDBM50036788
Synonyms:CHEMBL3354830
TypeSmall organic molecule
Emp. Form.C18H19ClN4O4S
Mol. Mass.422.886
SMILESCC(C)S(=O)(=O)c1c(Cl)ccc(Nc2nc(=O)cc([nH]2)-c2cccn2C)c1O