Reaction Details
TargetTyrosine-protein kinase ITK/TSK
LigandBDBM50037059
Substrate/Competitorn/a
Meas. Tech.ChEMBL_1435180 (CHEMBL3389531)
Ki 3000±n/a nM
Citation Trani, GBarker, JJBromidge, SMBrookfield, FABurch, JDChen, YEigenbrot, CHeifetz, AIsmaili, MHJohnson, AKrülle, TMMacKinnon, CHMaghames, RMcEwan, PAMontalbetti, CAOrtwine, DFPérez-Fuertes, YVaidya, DGWang, XZarrin, AAPei, Z Design, synthesis and structure-activity relationships of a novel class of sulfonylpyridine inhibitors of Interleukin-2 inducible T-cell kinase (ITK). Bioorg Med Chem Lett24:5818-23 (2014) 
 
Tyrosine-protein kinase ITK/TSK
Name:Tyrosine-protein kinase ITK/TSK
Type:Protein
Mol. Mass.:71839.20
Organism:Homo sapiens (Human)
Description:Q08881
Residue:620
BDBM50037059
NameBDBM50037059
Synonyms:CHEMBL3355310
TypeSmall organic molecule
Emp. Form.C14H13N5
Mol. Mass.251.2865
SMILESCc1cc(Nc2ccnc(n2)-c2ccccc2)n[nH]1