Reaction Details
TargetTyrosine-protein kinase ITK/TSK
LigandBDBM50037068
Substrate/Competitorn/a
Meas. Tech.ChEMBL_1435180 (CHEMBL3389531)
Ki 2.3±n/a nM
Citation Trani, GBarker, JJBromidge, SMBrookfield, FABurch, JDChen, YEigenbrot, CHeifetz, AIsmaili, MHJohnson, AKrülle, TMMacKinnon, CHMaghames, RMcEwan, PAMontalbetti, CAOrtwine, DFPérez-Fuertes, YVaidya, DGWang, XZarrin, AAPei, Z Design, synthesis and structure-activity relationships of a novel class of sulfonylpyridine inhibitors of Interleukin-2 inducible T-cell kinase (ITK). Bioorg Med Chem Lett24:5818-23 (2014) 
 
Tyrosine-protein kinase ITK/TSK
Name:Tyrosine-protein kinase ITK/TSK
Type:Protein
Mol. Mass.:71839.20
Organism:Homo sapiens (Human)
Description:Q08881
Residue:620
BDBM50037068
NameBDBM50037068
Synonyms:CHEMBL3355730
TypeSmall organic molecule
Emp. Form.C26H27N5O3S
Mol. Mass.489.589
SMILESO[C@H]1CC[C@@H](CC1)Nc1cc(cc(Nc2cc([nH]n2)-c2ccccc2)n1)S(=O)(=O)c1ccccc1