Reaction Details
TargetTyrosine-protein kinase ITK/TSK
LigandBDBM50037073
Substrate/Competitorn/a
Meas. Tech.ChEMBL_1435180 (CHEMBL3389531)
Ki 61±n/a nM
Citation Trani, GBarker, JJBromidge, SMBrookfield, FABurch, JDChen, YEigenbrot, CHeifetz, AIsmaili, MHJohnson, AKrülle, TMMacKinnon, CHMaghames, RMcEwan, PAMontalbetti, CAOrtwine, DFPérez-Fuertes, YVaidya, DGWang, XZarrin, AAPei, Z Design, synthesis and structure-activity relationships of a novel class of sulfonylpyridine inhibitors of Interleukin-2 inducible T-cell kinase (ITK). Bioorg Med Chem Lett24:5818-23 (2014) 
 
Tyrosine-protein kinase ITK/TSK
Name:Tyrosine-protein kinase ITK/TSK
Type:Protein
Mol. Mass.:71839.20
Organism:Homo sapiens (Human)
Description:Q08881
Residue:620
BDBM50037073
NameBDBM50037073
Synonyms:CHEMBL3355735
TypeSmall organic molecule
Emp. Form.C27H26F3N5O4S
Mol. Mass.573.587
SMILESO[C@H]1CC[C@@H](CC1)Nc1cc(cc(Nc2cc([nH]n2)-c2ccc(OC(F)(F)F)cc2)n1)S(=O)(=O)c1ccccc1