Reaction Details
TargetcAMP and cAMP-inhibited cGMP 3',5'-cyclic phosphodiesterase 10A
LigandBDBM99037
Substrate/Competitorn/a
Meas. Tech.ChEMBL_1437292 (CHEMBL3384795)
IC50 2.6±n/a nM
Citation Rzasa, RMFrohn, MJAndrews, KLChmait, SChen, NClarine, JGDavis, CEastwood, HAHorne, DBHu, EJones, ADKaller, MRKunz, RKMiller, SMonenschein, HNguyen, TPickrell, AJPorter, AReichelt, AZhao, XTreanor, JJAllen, JR Synthesis and preliminary biological evaluation of potent and selective 2-(3-alkoxy-1-azetidinyl) quinolines as novel PDE10A inhibitors with improved solubility. Bioorg Med Chem22:6570-85 (2015) 
 
cAMP and cAMP-inhibited cGMP 3',5'-cyclic phosphodiesterase 10A
Name:cAMP and cAMP-inhibited cGMP 3',5'-cyclic phosphodiesterase 10A
Type:Protein
Mol. Mass.:88412.52
Organism:Homo sapiens (Human)
Description:Q9Y233
Residue:1055
BDBM99037
NameBDBM99037
Synonyms:US8497265, 677
TypeSmall organic molecule
Emp. Form.C27H27N5O2
Mol. Mass.453.5356
SMILESCC(=O)N1CCC(CC1)c1nc2ccccc2nc1OC1CN(C1)c1ccc2ccccc2n1