Reaction Details
TargetAmine oxidase [flavin-containing] B
LigandBDBM50038050
Substrate/Competitorn/a
Meas. Tech.ChEMBL_1440356 (CHEMBL3385618)
IC50 8.9±n/a nM
Citation Pisani, LFarina, RNicolotti, OGadaleta, DSoto-Otero, RCatto, MDi Braccio, MMendez-Alvarez, ECarotti, A In silico design of novel 2H-chromen-2-one derivatives as potent and selective MAO-B inhibitors. Eur J Med Chem89:98-105 (2014) 
 
Amine oxidase [flavin-containing] B
Name:Amine oxidase [flavin-containing] B
Type:Enzyme
Mol. Mass.:58469.65
Organism:Rattus norvegicus (rat)
Description:P19643
Residue:520
BDBM50038050
NameBDBM50038050
Synonyms:CHEMBL3094017
TypeSmall organic molecule
Emp. Form.C18H14BrNO5
Mol. Mass.404.211
SMILESNC(=O)COc1cc(=O)oc2cc(OCc3cccc(Br)c3)ccc12