Reaction Details
TargetAmine oxidase [flavin-containing] B
LigandBDBM19188
Substrate/Competitorn/a
Meas. Tech.ChEMBL_1440356 (CHEMBL3385618)
IC50 13±n/a nM
Citation Pisani, LFarina, RNicolotti, OGadaleta, DSoto-Otero, RCatto, MDi Braccio, MMendez-Alvarez, ECarotti, A In silico design of novel 2H-chromen-2-one derivatives as potent and selective MAO-B inhibitors. Eur J Med Chem89:98-105 (2014) 
 
Amine oxidase [flavin-containing] B
Name:Amine oxidase [flavin-containing] B
Type:Enzyme
Mol. Mass.:58469.65
Organism:Rattus norvegicus (rat)
Description:P19643
Residue:520
BDBM19188
NameBDBM19188
Synonyms:7-(3-chlorobenzyloxy)-4-(methylamino)methyl-coumarin, 2 C18 | CHEMBL593763
TypeSmall organic molecule
Emp. Form.C18H16ClNO3
Mol. Mass.329.778
SMILESCNCc1cc(=O)oc2cc(OCc3cccc(Cl)c3)ccc12