Reaction Details
TargetTyrosine-protein kinase BTK
LigandBDBM50039976
Substrate/Competitorn/a
Meas. Tech.ChEMBL_1446183 (CHEMBL3371883)
IC50 1600±n/a nM
Citation Lou, YSweeney, ZKKuglstatter, ADavis, DGoldstein, DMHan, XHong, JKocer, BKondru, RKLitman, RMcIntosh, JSarma, KSuh, JTaygerly, JOwens, TD Finding the perfect spot for fluorine: improving potency up to 40-fold during a rational fluorine scan of a Bruton's Tyrosine Kinase (BTK) inhibitor scaffold. Bioorg Med Chem Lett25:367-71 (2014) 
 
Tyrosine-protein kinase BTK
Name:Tyrosine-protein kinase BTK
Type:Enzyme
Mol. Mass.:76289.95
Organism:Homo sapiens (Human)
Description:Q06187
Residue:659
BDBM50039976
NameBDBM50039976
Synonyms:CHEMBL3358342
TypeSmall organic molecule
Emp. Form.C36H38N6O3
Mol. Mass.602.7253
SMILESCCN1CCN(CC1)c1ccc(Nc2cc(cn(C)c2=O)-c2cccc(c2CO)-n2ccc3cc(ccc3c2=O)C2CC2)nc1