Reaction Details
TargetCannabinoid receptor 2
LigandBDBM50042590
Substrate/Competitorn/a
Meas. Tech.ChEMBL_1444454 (CHEMBL3373562)
EC50 3.0±n/a nM
Citation Riether, DZindell, RWu, LBetageri, RJenkins, JEKhor, SBerry, AKHickey, ERErmann, MAlbrecht, CCeci, AGemkow, MJNagaraja, NVRomig, HSauer, AThomson, DS Selective CB2 receptor agonists. Part 2: Structure-activity relationship studies and optimization of proline-based compounds. Bioorg Med Chem Lett25:581-6 (2015) 
 
Cannabinoid receptor 2
Name:Cannabinoid receptor 2
Type:G Protein-Coupled Receptor (GPCR)
Mol. Mass.:39690.94
Organism:Homo sapiens (Human)
Description:P34972
Residue:360
BDBM50042590
NameBDBM50042590
Synonyms:CHEMBL3353863
TypeSmall organic molecule
Emp. Form.C18H22ClN3O2
Mol. Mass.347.839
SMILESCC(C)(C)c1cc(NC(=O)[C@@H]2CCCN2c2ccc(Cl)cc2)no1