Reaction Details
TargetCannabinoid receptor 2
LigandBDBM50006232
Substrate/Competitorn/a
Meas. Tech.ChEMBL_1444456 (CHEMBL3373564)
EC50 1.2±n/a nM
Citation Riether, DZindell, RWu, LBetageri, RJenkins, JEKhor, SBerry, AKHickey, ERErmann, MAlbrecht, CCeci, AGemkow, MJNagaraja, NVRomig, HSauer, AThomson, DS Selective CB2 receptor agonists. Part 2: Structure-activity relationship studies and optimization of proline-based compounds. Bioorg Med Chem Lett25:581-6 (2015) 
 
Cannabinoid receptor 2
Name:Cannabinoid receptor 2
Type:G Protein-Coupled Receptor (GPCR)
Mol. Mass.:39690.94
Organism:Homo sapiens (Human)
Description:P34972
Residue:360
BDBM50006232
NameBDBM50006232
Synonyms:CHEMBL3235058
TypeSmall organic molecule
Emp. Form.C17H19F3N4O2
Mol. Mass.368.3536
SMILESCC(C)(C)c1cc(NC(=O)[C@@H]2CCN2c2ccc(cn2)C(F)(F)F)no1