Reaction Details
TargetCannabinoid receptor 1
LigandBDBM50042659
Substrate/Competitorn/a
Meas. Tech.ChEMBL_1444457 (CHEMBL3373565)
EC50 7200±n/a nM
Citation Riether, DZindell, RWu, LBetageri, RJenkins, JEKhor, SBerry, AKHickey, ERErmann, MAlbrecht, CCeci, AGemkow, MJNagaraja, NVRomig, HSauer, AThomson, DS Selective CB2 receptor agonists. Part 2: Structure-activity relationship studies and optimization of proline-based compounds. Bioorg Med Chem Lett25:581-6 (2015) 
 
Cannabinoid receptor 1
Name:Cannabinoid receptor 1
Type:G Protein-Coupled Receptor (GPCR)
Mol. Mass.:52868.96
Organism:Homo sapiens (Human)
Description:P21554
Residue:472
BDBM50042659
NameBDBM50042659
Synonyms:CHEMBL3353870 US10570125, Example 190 US11725004, Example 190 in WO2010077836
TypeSmall organic molecule
Emp. Form.C17H27N3O3
Mol. Mass.321.4146
SMILESCC(C)(C)c1cc(NC(=O)[C@@H]2CCCN2C2CCOCC2)on1