Reaction Details
TargetCannabinoid receptor 1
LigandBDBM50042685
Substrate/Competitorn/a
Meas. Tech.ChEMBL_1444457 (CHEMBL3373565)
EC50 17000±n/a nM
Citation Riether, DZindell, RWu, LBetageri, RJenkins, JEKhor, SBerry, AKHickey, ERErmann, MAlbrecht, CCeci, AGemkow, MJNagaraja, NVRomig, HSauer, AThomson, DS Selective CB2 receptor agonists. Part 2: Structure-activity relationship studies and optimization of proline-based compounds. Bioorg Med Chem Lett25:581-6 (2015) 
 
Cannabinoid receptor 1
Name:Cannabinoid receptor 1
Type:G Protein-Coupled Receptor (GPCR)
Mol. Mass.:52868.96
Organism:Homo sapiens (Human)
Description:P21554
Residue:472
BDBM50042685
NameBDBM50042685
Synonyms:CHEMBL3353873
TypeSmall organic molecule
Emp. Form.C17H20ClN3O2S
Mol. Mass.365.878
SMILESClc1ccc2sc(NC(=O)[C@@H]3CCCN3C3CCOCC3)nc2c1