Reaction Details
TargetCytochrome P450 2D6
LigandBDBM50042590
Substrate/Competitorn/a
Meas. Tech.ChEMBL_1444466 (CHEMBL3373574)
IC50>50000±n/a nM
Citation Riether, DZindell, RWu, LBetageri, RJenkins, JEKhor, SBerry, AKHickey, ERErmann, MAlbrecht, CCeci, AGemkow, MJNagaraja, NVRomig, HSauer, AThomson, DS Selective CB2 receptor agonists. Part 2: Structure-activity relationship studies and optimization of proline-based compounds. Bioorg Med Chem Lett25:581-6 (2015) 
 
Cytochrome P450 2D6
Name:Cytochrome P450 2D6
Type:Protein
Mol. Mass.:55774.82
Organism:Homo sapiens (Human)
Description:P10635
Residue:497
BDBM50042590
NameBDBM50042590
Synonyms:CHEMBL3353863
TypeSmall organic molecule
Emp. Form.C18H22ClN3O2
Mol. Mass.347.839
SMILESCC(C)(C)c1cc(NC(=O)[C@@H]2CCCN2c2ccc(Cl)cc2)no1