Reaction Details
TargetCannabinoid receptor 2
LigandBDBM50042699
Substrate/Competitorn/a
Meas. Tech.ChEMBL_1444456 (CHEMBL3373564)
EC50 6.1±n/a nM
Citation Riether, DZindell, RWu, LBetageri, RJenkins, JEKhor, SBerry, AKHickey, ERErmann, MAlbrecht, CCeci, AGemkow, MJNagaraja, NVRomig, HSauer, AThomson, DS Selective CB2 receptor agonists. Part 2: Structure-activity relationship studies and optimization of proline-based compounds. Bioorg Med Chem Lett25:581-6 (2015) 
 
Cannabinoid receptor 2
Name:Cannabinoid receptor 2
Type:G Protein-Coupled Receptor (GPCR)
Mol. Mass.:39690.94
Organism:Homo sapiens (Human)
Description:P34972
Residue:360
BDBM50042699
NameBDBM50042699
Synonyms:CHEMBL3353880
TypeSmall organic molecule
Emp. Form.C18H20ClN3O3
Mol. Mass.361.823
SMILESCC(C)(C)c1cc(NC(=O)[C@@H]2CCC(=O)N2c2ccc(Cl)cc2)on1