Reaction Details
TargetCannabinoid receptor 2
LigandBDBM50042694
Substrate/Competitorn/a
Meas. Tech.ChEMBL_1444456 (CHEMBL3373564)
EC50 170±n/a nM
Citation Riether, DZindell, RWu, LBetageri, RJenkins, JEKhor, SBerry, AKHickey, ERErmann, MAlbrecht, CCeci, AGemkow, MJNagaraja, NVRomig, HSauer, AThomson, DS Selective CB2 receptor agonists. Part 2: Structure-activity relationship studies and optimization of proline-based compounds. Bioorg Med Chem Lett25:581-6 (2015) 
 
Cannabinoid receptor 2
Name:Cannabinoid receptor 2
Type:G Protein-Coupled Receptor (GPCR)
Mol. Mass.:39690.94
Organism:Homo sapiens (Human)
Description:P34972
Residue:360
BDBM50042694
NameBDBM50042694
Synonyms:CHEMBL3353875
TypeSmall organic molecule
Emp. Form.C17H21ClN4O2
Mol. Mass.348.827
SMILESClc1ccc2[nH]c(NC(=O)[C@@H]3CCCN3C3CCOCC3)nc2c1