Reaction Details
TargetCathepsin S
LigandBDBM50042854
Substrate/Competitorn/a
Meas. Tech.ChEMBL_1444645 (CHEMBL3376643)
IC50>100000±n/a nM
Citation Grosche, PSirockin, FMac Sweeney, ARamage, PErbel, PMelkko, SBernardi, AHughes, NEllis, DCombrink, KDJarousse, NAltmann, E Structure-based design and optimization of potent inhibitors of the adenoviral protease. Bioorg Med Chem Lett25:438-43 (2015) 
 
Cathepsin S
Name:Cathepsin S
Type:Protein
Mol. Mass.:37507.38
Organism:Homo sapiens (Human)
Description:P25774
Residue:331
BDBM50042854
NameBDBM50042854
Synonyms:CHEMBL3354497
TypeSmall organic molecule
Emp. Form.C20H27Cl2N3O5S
Mol. Mass.492.416
SMILESCC(C)(C)[C@H](NC(=O)Cc1cc(Cl)cc(Cl)c1)C(=O)NCC(=O)NC\C=C\S(C)(=O)=O