Reaction Details
TargetCathepsin S
LigandBDBM50042850
Substrate/Competitorn/a
Meas. Tech.ChEMBL_1444645 (CHEMBL3376643)
IC50>100000±n/a nM
Citation Grosche, PSirockin, FMac Sweeney, ARamage, PErbel, PMelkko, SBernardi, AHughes, NEllis, DCombrink, KDJarousse, NAltmann, E Structure-based design and optimization of potent inhibitors of the adenoviral protease. Bioorg Med Chem Lett25:438-43 (2015) 
 
Cathepsin S
Name:Cathepsin S
Type:Protein
Mol. Mass.:37507.38
Organism:Homo sapiens (Human)
Description:P25774
Residue:331
BDBM50042850
NameBDBM50042850
Synonyms:CHEMBL3354492
TypeSmall organic molecule
Emp. Form.C22H21Cl2N3O4
Mol. Mass.462.326
SMILESCOc1ccc(cc1C(=O)C(C)(C)c1cc(Cl)cc(Cl)c1)C(=O)NCC(=O)NCC#N