Reaction Details
TargetProcathepsin L
LigandBDBM50042850
Substrate/Competitorn/a
Meas. Tech.ChEMBL_1444644 (CHEMBL3376642)
IC50>100000±n/a nM
Citation Grosche, PSirockin, FMac Sweeney, ARamage, PErbel, PMelkko, SBernardi, AHughes, NEllis, DCombrink, KDJarousse, NAltmann, E Structure-based design and optimization of potent inhibitors of the adenoviral protease. Bioorg Med Chem Lett25:438-43 (2015) 
 
Procathepsin L
Name:Procathepsin L
Type:Enzyme
Mol. Mass.:37557.19
Organism:Homo sapiens (Human)
Description:Purchased from Calbiochem (San Diego, CA).
Residue:333
BDBM50042850
NameBDBM50042850
Synonyms:CHEMBL3354492
TypeSmall organic molecule
Emp. Form.C22H21Cl2N3O4
Mol. Mass.462.326
SMILESCOc1ccc(cc1C(=O)C(C)(C)c1cc(Cl)cc(Cl)c1)C(=O)NCC(=O)NCC#N