Reaction Details
TargetCathepsin K
LigandBDBM50042852
Substrate/Competitorn/a
Meas. Tech.ChEMBL_1444643 (CHEMBL3376641)
IC50 73000±n/a nM
Citation Grosche, PSirockin, FMac Sweeney, ARamage, PErbel, PMelkko, SBernardi, AHughes, NEllis, DCombrink, KDJarousse, NAltmann, E Structure-based design and optimization of potent inhibitors of the adenoviral protease. Bioorg Med Chem Lett25:438-43 (2015) 
 
Cathepsin K
Name:Cathepsin K
Type:Enzyme
Mol. Mass.:36975.68
Organism:Homo sapiens (Human)
Description:P43235
Residue:329
BDBM50042852
NameBDBM50042852
Synonyms:CHEMBL3354498
TypeSmall organic molecule
Emp. Form.C22H32Cl2N4O5S
Mol. Mass.535.484
SMILESCCN[C@H](C(=O)N[C@H](C(=O)NCC(=O)NC\C=C\S(C)(=O)=O)C(C)(C)C)c1cc(Cl)cc(Cl)c1