Reaction Details
TargetDipeptidyl peptidase 1
LigandBDBM50042852
Substrate/Competitorn/a
Meas. Tech.ChEMBL_1444642 (CHEMBL3376640)
IC50>100000±n/a nM
Citation Grosche, PSirockin, FMac Sweeney, ARamage, PErbel, PMelkko, SBernardi, AHughes, NEllis, DCombrink, KDJarousse, NAltmann, E Structure-based design and optimization of potent inhibitors of the adenoviral protease. Bioorg Med Chem Lett25:438-43 (2015) 
 
Dipeptidyl peptidase 1
Name:Dipeptidyl peptidase 1
Type:Enzyme
Mol. Mass.:51857.28
Organism:Homo sapiens (Human)
Description:P53634
Residue:463
BDBM50042852
NameBDBM50042852
Synonyms:CHEMBL3354498
TypeSmall organic molecule
Emp. Form.C22H32Cl2N4O5S
Mol. Mass.535.484
SMILESCCN[C@H](C(=O)N[C@H](C(=O)NCC(=O)NC\C=C\S(C)(=O)=O)C(C)(C)C)c1cc(Cl)cc(Cl)c1