Reaction Details
TargetSerine/threonine-protein kinase pim-2
LigandBDBM50042864
Substrate/Competitorn/a
Meas. Tech.ChEMBL_1444649 (CHEMBL3376647)
IC50 250±n/a nM
Citation Ishchenko, AZhang, LLe Brazidec, JYFan, JChong, JHHingway, ARaditsis, ASingh, LElenbaas, BHong, VSMarcotte, DSilvian, LEnyedy, IChao, J Structure-based design of low-nanomolar PIM kinase inhibitors. Bioorg Med Chem Lett25:474-80 (2015) 
 
Serine/threonine-protein kinase pim-2
Name:Serine/threonine-protein kinase pim-2
Type:Serine/threonine-protein kinase
Mol. Mass.:34185.93
Organism:Homo sapiens (Human)
Description:Q9P1W9
Residue:311
BDBM50042864
NameBDBM50042864
Synonyms:CHEMBL3354514
TypeSmall organic molecule
Emp. Form.C21H19F2N3O2S
Mol. Mass.415.456
SMILESFc1cccc(F)c1-c1nc(cs1)C(=O)Nc1cnccc1OC1CCCCC1