Reaction Details
TargetSerine/threonine-protein kinase pim-3
LigandBDBM50042867
Substrate/Competitorn/a
Meas. Tech.ChEMBL_1444650 (CHEMBL3376648)
IC50 2.0±n/a nM
Citation Ishchenko, AZhang, LLe Brazidec, JYFan, JChong, JHHingway, ARaditsis, ASingh, LElenbaas, BHong, VSMarcotte, DSilvian, LEnyedy, IChao, J Structure-based design of low-nanomolar PIM kinase inhibitors. Bioorg Med Chem Lett25:474-80 (2015) 
 
Serine/threonine-protein kinase pim-3
Name:Serine/threonine-protein kinase pim-3
Type:Protein
Mol. Mass.:35888.19
Organism:Homo sapiens (Human)
Description:Q86V86
Residue:326
BDBM50042867
NameBDBM50042867
Synonyms:CHEMBL3354517
TypeSmall organic molecule
Emp. Form.C21H19F2N3O3S
Mol. Mass.431.456
SMILESO[C@H]1CC[C@@H](CC1)Oc1ccncc1NC(=O)c1csc(n1)-c1c(F)cccc1F