Reaction Details
TargetMitogen-activated protein kinase kinase kinase kinase 5
LigandBDBM50043416
Substrate/Competitorn/a
Meas. Tech.ChEMBL_1445037 (CHEMBL3372969)
IC50>100000±n/a nM
Citation Goodwin, NCCianchetta, GBurgoon, HAHealy, JMabon, RStrobel, EDAllen, JWang, SHamman, BDRawlins, DB Discovery of a Type III Inhibitor of LIM Kinase 2 That Binds in a DFG-Out Conformation. ACS Med Chem Lett6:53-7 (2015) 
 
Mitogen-activated protein kinase kinase kinase kinase 5
Name:Mitogen-activated protein kinase kinase kinase kinase 5
Type:PROTEIN
Mol. Mass.:95039.51
Organism:Homo sapiens (Human)
Description:ChEMBL_1495741
Residue:846
BDBM50043416
NameBDBM50043416
Synonyms:CHEMBL3355482
TypeSmall organic molecule
Emp. Form.C21H20N2O3S
Mol. Mass.380.46
SMILESCN(Cc1ccccc1)C(=O)c1ccc(cc1)S(=O)(=O)Nc1ccccc1