Reaction Details
TargetSerine/threonine-protein kinase 3
LigandBDBM50043416
Substrate/Competitorn/a
Meas. Tech.ChEMBL_1445034 (CHEMBL3372966)
IC50>100000±n/a nM
Citation Goodwin, NCCianchetta, GBurgoon, HAHealy, JMabon, RStrobel, EDAllen, JWang, SHamman, BDRawlins, DB Discovery of a Type III Inhibitor of LIM Kinase 2 That Binds in a DFG-Out Conformation. ACS Med Chem Lett6:53-7 (2015) 
 
Serine/threonine-protein kinase 3
Name:Serine/threonine-protein kinase 3
Type:Serine/threonine-protein kinase
Mol. Mass.:56284.87
Organism:Homo sapiens (Human)
Description:n/a
Residue:491
BDBM50043416
NameBDBM50043416
Synonyms:CHEMBL3355482
TypeSmall organic molecule
Emp. Form.C21H20N2O3S
Mol. Mass.380.46
SMILESCN(Cc1ccccc1)C(=O)c1ccc(cc1)S(=O)(=O)Nc1ccccc1