Reaction Details
TargetFree fatty acid receptor 4
LigandBDBM50044848
Substrate/Competitorn/a
Meas. Tech.ChEMBL_1454419 (CHEMBL3364891)
EC50 6310±n/a nM
Citation Sparks, SMChen, GCollins, JLDanger, DDock, STJayawickreme, CJenkinson, SLaudeman, CLeesnitzer, MALiang, XMaloney, PMcCoy, DCMoncol, DRash, VRimele, TVulimiri, PWay, JMRoss, S Identification of diarylsulfonamides as agonists of the free fatty acid receptor 4 (FFA4/GPR120). Bioorg Med Chem Lett24:3100-3 (2014) 
 
Free fatty acid receptor 4
Name:Free fatty acid receptor 4
Type:PROTEIN
Mol. Mass.:42256.91
Organism:Homo sapiens (Human)
Description:ChEMBL_1508994
Residue:377
BDBM50044848
NameBDBM50044848
Synonyms:CHEMBL3311317
TypeSmall organic molecule
Emp. Form.C15H16FNO2S
Mol. Mass.293.356
SMILESCc1cc(C)c(NS(=O)(=O)c2ccc(F)cc2)c(C)c1