Reaction Details
TargetFree fatty acid receptor 4
LigandBDBM50044849
Substrate/Competitorn/a
Meas. Tech.ChEMBL_1454421 (CHEMBL3364893)
EC50 794±n/a nM
Citation Sparks, SMChen, GCollins, JLDanger, DDock, STJayawickreme, CJenkinson, SLaudeman, CLeesnitzer, MALiang, XMaloney, PMcCoy, DCMoncol, DRash, VRimele, TVulimiri, PWay, JMRoss, S Identification of diarylsulfonamides as agonists of the free fatty acid receptor 4 (FFA4/GPR120). Bioorg Med Chem Lett24:3100-3 (2014) 
 
Free fatty acid receptor 4
Name:Free fatty acid receptor 4
Type:PROTEIN
Mol. Mass.:40917.30
Organism:Rattus norvegicus
Description:ChEMBL_109428
Residue:361
BDBM50044849
NameBDBM50044849
Synonyms:CHEMBL3311308
TypeSmall organic molecule
Emp. Form.C16H19NO3S
Mol. Mass.305.392
SMILESCOc1ccc(cc1)S(=O)(=O)Nc1c(C)cc(C)cc1C