Reaction Details
TargetActivin receptor type-2B
LigandBDBM50044849
Substrate/Competitorn/a
Meas. Tech.ChEMBL_1455273 (CHEMBL3362279)
IC50<25119±n/a nM
Citation Sparks, SMChen, GCollins, JLDanger, DDock, STJayawickreme, CJenkinson, SLaudeman, CLeesnitzer, MALiang, XMaloney, PMcCoy, DCMoncol, DRash, VRimele, TVulimiri, PWay, JMRoss, S Identification of diarylsulfonamides as agonists of the free fatty acid receptor 4 (FFA4/GPR120). Bioorg Med Chem Lett24:3100-3 (2014) 
 
Activin receptor type-2B
Name:Activin receptor type-2B
Type:Enzyme Catalytic Domain
Mol. Mass.:57713.76
Organism:Homo sapiens (Human)
Description:gi_116734708
Residue:512
BDBM50044849
NameBDBM50044849
Synonyms:CHEMBL3311308
TypeSmall organic molecule
Emp. Form.C16H19NO3S
Mol. Mass.305.392
SMILESCOc1ccc(cc1)S(=O)(=O)Nc1c(C)cc(C)cc1C