Reaction Details
TargetPeroxisome proliferator-activated receptor alpha
LigandBDBM50044849
Substrate/Competitorn/a
Meas. Tech.ChEMBL_1456187 (CHEMBL3361942)
IC50<25119±n/a nM
Citation Sparks, SMChen, GCollins, JLDanger, DDock, STJayawickreme, CJenkinson, SLaudeman, CLeesnitzer, MALiang, XMaloney, PMcCoy, DCMoncol, DRash, VRimele, TVulimiri, PWay, JMRoss, S Identification of diarylsulfonamides as agonists of the free fatty acid receptor 4 (FFA4/GPR120). Bioorg Med Chem Lett24:3100-3 (2014) 
 
Peroxisome proliferator-activated receptor alpha
Name:Peroxisome proliferator-activated receptor alpha
Type:Enzyme
Mol. Mass.:52222.08
Organism:Homo sapiens (Human)
Description:Q07869
Residue:468
BDBM50044849
NameBDBM50044849
Synonyms:CHEMBL3311308
TypeSmall organic molecule
Emp. Form.C16H19NO3S
Mol. Mass.305.392
SMILESCOc1ccc(cc1)S(=O)(=O)Nc1c(C)cc(C)cc1C