Reaction Details
TargetFree fatty acid receptor 1
LigandBDBM50044849
Substrate/Competitorn/a
Meas. Tech.ChEMBL_1454431 (CHEMBL3365227)
EC50<31623±n/a nM
Citation Sparks, SMChen, GCollins, JLDanger, DDock, STJayawickreme, CJenkinson, SLaudeman, CLeesnitzer, MALiang, XMaloney, PMcCoy, DCMoncol, DRash, VRimele, TVulimiri, PWay, JMRoss, S Identification of diarylsulfonamides as agonists of the free fatty acid receptor 4 (FFA4/GPR120). Bioorg Med Chem Lett24:3100-3 (2014) 
 
Free fatty acid receptor 1
Name:Free fatty acid receptor 1
Type:PROTEIN
Mol. Mass.:31818.80
Organism:Mus musculus
Description:ChEMBL_1454431
Residue:300
BDBM50044849
NameBDBM50044849
Synonyms:CHEMBL3311308
TypeSmall organic molecule
Emp. Form.C16H19NO3S
Mol. Mass.305.392
SMILESCOc1ccc(cc1)S(=O)(=O)Nc1c(C)cc(C)cc1C