Reaction Details
TargetFree fatty acid receptor 1
LigandBDBM50044874
Substrate/Competitorn/a
Meas. Tech.ChEMBL_1454437 (CHEMBL3365233)
IC50<25119±n/a nM
Citation Sparks, SMChen, GCollins, JLDanger, DDock, STJayawickreme, CJenkinson, SLaudeman, CLeesnitzer, MALiang, XMaloney, PMcCoy, DCMoncol, DRash, VRimele, TVulimiri, PWay, JMRoss, S Identification of diarylsulfonamides as agonists of the free fatty acid receptor 4 (FFA4/GPR120). Bioorg Med Chem Lett24:3100-3 (2014) 
 
Free fatty acid receptor 1
Name:Free fatty acid receptor 1
Type:G Protein-Coupled Receptor (GPCR)
Mol. Mass.:31473.32
Organism:Homo sapiens (Human)
Description:O14842
Residue:300
BDBM50044874
NameBDBM50044874
Synonyms:CHEMBL3311302
TypeSmall organic molecule
Emp. Form.C20H17NO3S
Mol. Mass.351.419
SMILESCc1ccc(cc1)S(=O)(=O)NC1c2ccccc2Oc2ccccc12