Reaction Details
TargetSolute carrier family 5 (neutral amino acid transporters, system A), member 4b
LigandBDBM50044849
Substrate/Competitorn/a
Meas. Tech.ChEMBL_1456196 (CHEMBL3361951)
IC50<39811±n/a nM
Citation Sparks, SMChen, GCollins, JLDanger, DDock, STJayawickreme, CJenkinson, SLaudeman, CLeesnitzer, MALiang, XMaloney, PMcCoy, DCMoncol, DRash, VRimele, TVulimiri, PWay, JMRoss, S Identification of diarylsulfonamides as agonists of the free fatty acid receptor 4 (FFA4/GPR120). Bioorg Med Chem Lett24:3100-3 (2014) 
 
Solute carrier family 5 (neutral amino acid transporters, system A), member 4b
Name:Solute carrier family 5 (neutral amino acid transporters, system A), member 4b
Type:PROTEIN
Mol. Mass.:72244.70
Organism:Mus musculus
Description:ChEMBL_109433
Residue:660
BDBM50044849
NameBDBM50044849
Synonyms:CHEMBL3311308
TypeSmall organic molecule
Emp. Form.C16H19NO3S
Mol. Mass.305.392
SMILESCOc1ccc(cc1)S(=O)(=O)Nc1c(C)cc(C)cc1C