Reaction Details
TargetBcl-2-like protein 1
LigandBDBM50044939
Substrate/Competitorn/a
Meas. Tech.ChEMBL_1457124 (CHEMBL3369468)
IC50 21±n/a nM
Citation Varnes, JGGero, THuang, SDiebold, RBOgoe, CGrover, PTSu, MMukherjee, PSaeh, JCMacIntyre, TRepik, GDillman, KByth, KRussell, DJIoannidis, S Towards the next generation of dual Bcl-2/Bcl-xL inhibitors. Bioorg Med Chem Lett24:3026-33 (2014) 
 
Bcl-2-like protein 1
Name:Bcl-2-like protein 1
Type:Mitochondrion membrane; Single-pass membrane protein
Mol. Mass.:26039.60
Organism:Homo sapiens (Human)
Description:n/a
Residue:233
BDBM50044939
NameBDBM50044939
Synonyms:CHEMBL3309283
TypeSmall organic molecule
Emp. Form.C45H46ClF3N4O8S4
Mol. Mass.991.577
SMILESFC(F)(F)S(=O)(=O)c1cc(ccc1N[C@H](CCN1CCOCC1)CSc1ccccc1)S(=O)(=O)NC(=O)c1ccc(cc1)N1CCC(CC1)S(=O)(=O)c1ccccc1-c1ccc(Cl)cc1