Reaction Details
TargetBcl-2-like protein 1
LigandBDBM50044927
Substrate/Competitorn/a
Meas. Tech.ChEMBL_1457124 (CHEMBL3369468)
IC50 10.0±n/a nM
Citation Varnes, JGGero, THuang, SDiebold, RBOgoe, CGrover, PTSu, MMukherjee, PSaeh, JCMacIntyre, TRepik, GDillman, KByth, KRussell, DJIoannidis, S Towards the next generation of dual Bcl-2/Bcl-xL inhibitors. Bioorg Med Chem Lett24:3026-33 (2014) 
 
Bcl-2-like protein 1
Name:Bcl-2-like protein 1
Type:Mitochondrion membrane; Single-pass membrane protein
Mol. Mass.:26039.60
Organism:Homo sapiens (Human)
Description:n/a
Residue:233
BDBM50044927
NameBDBM50044927
Synonyms:CHEMBL3309313
TypeSmall organic molecule
Emp. Form.C49H56ClF3N6O7S3
Mol. Mass.1029.648
SMILESCN(C)CCOc1ccc(c(CN2CCN(CC2)c2ccc(cc2)C(=O)NS(=O)(=O)c2ccc(N[C@H](CCN3CCOCC3)CSc3ccccc3)c(c2)S(=O)(=O)C(F)(F)F)c1)-c1ccc(Cl)cc1