Reaction Details
TargetTyrosine-protein phosphatase non-receptor type 1
LigandBDBM50045063
Substrate/Competitorn/a
Meas. Tech.ChEMBL_1456270 (CHEMBL3367793)
IC50 11800±n/a nM
Citation Zhi, YGao, LXJin, YTang, CLLi, JYLi, JLong, YQ 4-Quinolone-3-carboxylic acids as cell-permeable inhibitors of protein tyrosine phosphatase 1B. Bioorg Med Chem22:3670-83 (2014) 
 
Tyrosine-protein phosphatase non-receptor type 1
Name:Tyrosine-protein phosphatase non-receptor type 1
Type:Protein phosphatase
Mol. Mass.:49963.76
Organism:Homo sapiens (Human)
Description:Human recombinant GST-fusion PTP1B (1-435).
Residue:435
BDBM50045063
NameBDBM50045063
Synonyms:CHEMBL3309792
TypeSmall organic molecule
Emp. Form.C28H24FN3O8
Mol. Mass.549.5039
SMILESCOC(=O)c1c(O)cccc1OCCCNC(=O)c1cn(Cc2ccc(F)cc2)c2ccc(cc2c1=O)[N+]([O-])=O