Reaction Details
TargetTyrosine-protein phosphatase non-receptor type 1
LigandBDBM50045064
Substrate/Competitorn/a
Meas. Tech.ChEMBL_1456270 (CHEMBL3367793)
IC50 73800±n/a nM
Citation Zhi, YGao, LXJin, YTang, CLLi, JYLi, JLong, YQ 4-Quinolone-3-carboxylic acids as cell-permeable inhibitors of protein tyrosine phosphatase 1B. Bioorg Med Chem22:3670-83 (2014) 
 
Tyrosine-protein phosphatase non-receptor type 1
Name:Tyrosine-protein phosphatase non-receptor type 1
Type:Protein phosphatase
Mol. Mass.:49963.76
Organism:Homo sapiens (Human)
Description:Human recombinant GST-fusion PTP1B (1-435).
Residue:435
BDBM50045064
NameBDBM50045064
Synonyms:CHEMBL3309793
TypeSmall organic molecule
Emp. Form.C35H37N3O7
Mol. Mass.611.6842
SMILESCOC(=O)c1c(OCCCN2CCN(CC2)c2ccc3n(cc(C(O)=O)c(=O)c3c2)C2CC2)cccc1OCc1ccccc1