Reaction Details
TargetSphingosine 1-phosphate receptor 1
LigandBDBM50045328
Substrate/Competitorn/a
Meas. Tech.ChEMBL_1458115 (CHEMBL3367912)
EC50 2.8±n/a nM
Citation Tsuji, TSuzuki, KNakamura, TGoto, TSekiguchi, YIkeda, TFukuda, TTakemoto, TMizuno, YKimura, TKawase, YNara, FKagari, TShimozato, TYahara, CInaba, SHonda, TIzumi, TTamura, MNishi, T Synthesis and SAR studies of benzyl ether derivatives as potent orally active S1P1 agonists. Bioorg Med Chem22:4246-56 (2014) 
 
Sphingosine 1-phosphate receptor 1
Name:Sphingosine 1-phosphate receptor 1
Type:Enzyme
Mol. Mass.:42836.02
Organism:Homo sapiens (Human)
Description:P21453
Residue:382
BDBM50045328
NameBDBM50045328
Synonyms:CHEMBL3311350
TypeSmall organic molecule
Emp. Form.C22H29FNO6P
Mol. Mass.453.4409
SMILESCc1ccc(CCCC(=O)c2ccc(COC[C@@](C)(N)COP(O)(O)=O)c(F)c2)cc1