Reaction Details
TargetSphingosine 1-phosphate receptor 1
LigandBDBM50045330
Substrate/Competitorn/a
Meas. Tech.ChEMBL_1458115 (CHEMBL3367912)
EC50 2.3±n/a nM
Citation Tsuji, TSuzuki, KNakamura, TGoto, TSekiguchi, YIkeda, TFukuda, TTakemoto, TMizuno, YKimura, TKawase, YNara, FKagari, TShimozato, TYahara, CInaba, SHonda, TIzumi, TTamura, MNishi, T Synthesis and SAR studies of benzyl ether derivatives as potent orally active S1P1 agonists. Bioorg Med Chem22:4246-56 (2014) 
 
Sphingosine 1-phosphate receptor 1
Name:Sphingosine 1-phosphate receptor 1
Type:Enzyme
Mol. Mass.:42836.02
Organism:Homo sapiens (Human)
Description:P21453
Residue:382
BDBM50045330
NameBDBM50045330
Synonyms:CHEMBL3311352
TypeSmall organic molecule
Emp. Form.C24H34NO6P
Mol. Mass.463.5036
SMILESCCc1cc(ccc1COC[C@@](C)(N)COP(O)(O)=O)C(=O)CCCc1ccc(C)cc1