Reaction Details
TargetSphingosine 1-phosphate receptor 3
LigandBDBM50045331
Substrate/Competitorn/a
Meas. Tech.ChEMBL_1458116 (CHEMBL3367913)
EC50 340±n/a nM
Citation Tsuji, TSuzuki, KNakamura, TGoto, TSekiguchi, YIkeda, TFukuda, TTakemoto, TMizuno, YKimura, TKawase, YNara, FKagari, TShimozato, TYahara, CInaba, SHonda, TIzumi, TTamura, MNishi, T Synthesis and SAR studies of benzyl ether derivatives as potent orally active S1P1 agonists. Bioorg Med Chem22:4246-56 (2014) 
 
Sphingosine 1-phosphate receptor 3
Name:Sphingosine 1-phosphate receptor 3
Type:G Protein-Coupled Receptor (GPCR)
Mol. Mass.:42278.13
Organism:Homo sapiens (Human)
Description:Q99500
Residue:378
BDBM50045331
NameBDBM50045331
Synonyms:CHEMBL3311353
TypeSmall organic molecule
Emp. Form.C24H34NO6P
Mol. Mass.463.5036
SMILESCc1ccc(CCCC(=O)c2cc(C)c(COC[C@@](C)(N)COP(O)(O)=O)c(C)c2)cc1